BDBM50231457 CHEMBL400236::N-(6-(2-(4-(benzo[d]isothiazol-3-yl)piperazin-1-yl)ethyl)-2,3-dihydro-1H-inden-1-yl)isobutyramide
SMILES CC(C)C(=O)NC1CCc2ccc(CCN3CCN(CC3)c3nsc4ccccc34)cc12
InChI Key InChIKey=NDCFZCPGTKKFMD-UHFFFAOYSA-N
Data  5 KI
  Tab Delimited (TSV)   2D SDfile   Computed 3D by Vconf -m prep SDfile
Find this compound or compounds like it in BindingDB:
Activity Spreadsheet -- Enzyme Inhibition Constant Data from BindingDB
Found 1 hit for monomerid = 50231457
Target5-hydroxytryptamine receptor 2A(Homo sapiens (Human))
Pfizer
Curated by ChEMBL
LigandPNGBDBM50231457(CHEMBL400236 | N-(6-(2-(4-(benzo[d]isothiazol-3-yl...)
Affinity DataKi:  0.75nM. Assay description: Displacement of [3H]ketanserin from human 5HT2A receptor expressed in Swiss 3T3 cells
In DepthDetails ArticlePubMed